Assertion Failed Fix

Assertion Failed Error - MC basically unusable - Avid Community

Assertion Failed Error - MC basically unusable - Avid Community

Use Debug Assert to find bugs in C# - C# HelperC# Helper

Use Debug Assert to find bugs in C# - C# HelperC# Helper

Integrating Test Assertions in C# - Modus Create

Integrating Test Assertions in C# - Modus Create

Selenium WebDriver Assertion assertNull Example With TestNG

Selenium WebDriver Assertion assertNull Example With TestNG

Custom Assertions in TestNG Framework - TestingDocs com

Custom Assertions in TestNG Framework - TestingDocs com

Testing Odoo — odoo 12 0 documentation

Testing Odoo — odoo 12 0 documentation

Assertion failed: Input argument is not an HTMLInputElement

Assertion failed: Input argument is not an HTMLInputElement

How to Use JMeter Assertions in Three Easy Steps | BlazeMeter

How to Use JMeter Assertions in Three Easy Steps | BlazeMeter

Assertion failed! help! - Technical Support - FiveM

Assertion failed! help! - Technical Support - FiveM

Assertion Failure on Eden Eternal - Help Section - Vendetta Gaming

Assertion Failure on Eden Eternal - Help Section - Vendetta Gaming

how to fix this loading screen error — Guild Wars 2 Forums

how to fix this loading screen error — Guild Wars 2 Forums

2018 3: Assertion failed: TLS Allocator ALLOC_TEMP_THREAD

2018 3: Assertion failed: TLS Allocator ALLOC_TEMP_THREAD

JMeter Assertions: The Ultimate Guide - Jmeter - OctoPerf

JMeter Assertions: The Ultimate Guide - Jmeter - OctoPerf

Assertion Failed Error - MC basically unusable - Avid Community

Assertion Failed Error - MC basically unusable - Avid Community

Assertion failed ark | Assertion faild  2019-04-10

Assertion failed ark | Assertion faild 2019-04-10

assertTrue(message,condition) in Selenium WebDriver and it's

assertTrue(message,condition) in Selenium WebDriver and it's

Debug Assertion Fails On Dynamic Array - Stack Overflow

Debug Assertion Fails On Dynamic Array - Stack Overflow

Hard and Soft Assertions in Selenium - Perficient Blogs

Hard and Soft Assertions in Selenium - Perficient Blogs

Handling File Corruptions | 3ds Max 2017 | Autodesk Knowledge Network

Handling File Corruptions | 3ds Max 2017 | Autodesk Knowledge Network

JMeter Duration Assertion with Example | Selenium Easy

JMeter Duration Assertion with Example | Selenium Easy

1 CEN 4072 Software Testing PPT12: Fixing the defect  - ppt download

1 CEN 4072 Software Testing PPT12: Fixing the defect - ppt download

Microsoft visual C++ runtime Library Assertion failed - Microsoft

Microsoft visual C++ runtime Library Assertion failed - Microsoft

Troubleshooting TwinCAT - SymbitronWiki

Troubleshooting TwinCAT - SymbitronWiki

Testing and validating API responses with JSON Schema : Assertible

Testing and validating API responses with JSON Schema : Assertible

How to fix debug assertion failed visual c++ windows 10

How to fix debug assertion failed visual c++ windows 10

Getting started with Assertions | Functional Testing

Getting started with Assertions | Functional Testing

Google Testing Blog: TotT: EXPECT vs  ASSERT

Google Testing Blog: TotT: EXPECT vs ASSERT

6 Troubleshooting Tips For Avid Media Composer Errors

6 Troubleshooting Tips For Avid Media Composer Errors

Retrospective: Feedback-directed Random Test Generation - ppt download

Retrospective: Feedback-directed Random Test Generation - ppt download

Assertion in selenium WebDriver using TestNg - Webkul Blog

Assertion in selenium WebDriver using TestNg - Webkul Blog

Debug Assertion Failed with the Default ATL Project Created by

Debug Assertion Failed with the Default ATL Project Created by

IBM ClearCase Project Explorer fails with error: Assertion failed

IBM ClearCase Project Explorer fails with error: Assertion failed

탁구야 탁구야 :: Microsoft Visual C++ Debug Library Debug Assertion

탁구야 탁구야 :: Microsoft Visual C++ Debug Library Debug Assertion

Steam Community :: Guide :: How to Fix

Steam Community :: Guide :: How to Fix "Assertion Failed" Crash

FMODSettings has uninitialized properties  Accessed too early? - UE4

FMODSettings has uninitialized properties Accessed too early? - UE4

Soft Assertions in Selenium using TestNG | TO THE NEW Blog

Soft Assertions in Selenium using TestNG | TO THE NEW Blog

Cannot Export Video, Can edit, Cannot upload - Mirillis forum

Cannot Export Video, Can edit, Cannot upload - Mirillis forum

DLLSpy - Tighten Your Defense by Discovering DLL Hijacking Easily

DLLSpy - Tighten Your Defense by Discovering DLL Hijacking Easily

Oldunreal Forums - Bugs in Jazz Jackrabbit 3 demo level editor

Oldunreal Forums - Bugs in Jazz Jackrabbit 3 demo level editor

Tutorial task-07 Error | ASSERTION FAILED · Issue #10016 · RIOT-OS

Tutorial task-07 Error | ASSERTION FAILED · Issue #10016 · RIOT-OS

Assertions | TestCafe Studio | DevExpress Documentation

Assertions | TestCafe Studio | DevExpress Documentation

Microsoft Visual C++ Runtime Library Assertion failed Mortal Kombat

Microsoft Visual C++ Runtime Library Assertion failed Mortal Kombat

How do i fix this widows error Solved - Windows 7 Help Forums

How do i fix this widows error Solved - Windows 7 Help Forums

EikonError401 - Forum | TR Developer Community

EikonError401 - Forum | TR Developer Community

Automating Processes with the Lightning Process Builder - System

Automating Processes with the Lightning Process Builder - System

Fluent Assertions 5 0: The best unit test assertion library in the

Fluent Assertions 5 0: The best unit test assertion library in the

automated testing - Jmeter Assertion failed - Software Quality

automated testing - Jmeter Assertion failed - Software Quality

I encounter problems starting the game  How do I fix it? – PUBG LITE

I encounter problems starting the game How do I fix it? – PUBG LITE

JMeter Response Assertion Example | Examples Java Code Geeks - 2019

JMeter Response Assertion Example | Examples Java Code Geeks - 2019

Debug Faster With Colourful Diffs For Your Failing Tests - DEV

Debug Faster With Colourful Diffs For Your Failing Tests - DEV

How to Use JMeter Assertions in Three Easy Steps | BlazeMeter

How to Use JMeter Assertions in Three Easy Steps | BlazeMeter

How to Fix CS:GO Failed to Connect to Match - Appuals com

How to Fix CS:GO Failed to Connect to Match - Appuals com

PyTest Tutorial: What is, Install, Fixture, Assertions

PyTest Tutorial: What is, Install, Fixture, Assertions

Node js Error Handling - AssertionError

Node js Error Handling - AssertionError

Assertions in SystemVerilog - Verification Guide

Assertions in SystemVerilog - Verification Guide

Old global vr arcade game not booting   noob needs help | Tom's

Old global vr arcade game not booting noob needs help | Tom's

Random error Assertion failed: TLS Allocator ALLOC_TEMP_THREAD

Random error Assertion failed: TLS Allocator ALLOC_TEMP_THREAD

100% fix for General Protection Fault :: Borderlands GOTY General

100% fix for General Protection Fault :: Borderlands GOTY General

Encrypted SAML Assertion Support When NetScaler is Used as Service

Encrypted SAML Assertion Support When NetScaler is Used as Service

How to fix Delphi Assertion failure using Windows 7 64bit | My

How to fix Delphi Assertion failure using Windows 7 64bit | My

Generate Native SystemVerilog Assertions from Simulink - MATLAB

Generate Native SystemVerilog Assertions from Simulink - MATLAB

How to fix Ghost Recon _ENGINE ASSERTION FAILED!_ Error

How to fix Ghost Recon _ENGINE ASSERTION FAILED!_ Error

Making a Unit Test Framework agnostic Assertion in C# · Los Techies

Making a Unit Test Framework agnostic Assertion in C# · Los Techies

bytes_transferred > 0 assertion fails · Issue #1373 · boostorg/beast

bytes_transferred > 0 assertion fails · Issue #1373 · boostorg/beast

CarND: Assertions and Debugging your C++ projects with CLion

CarND: Assertions and Debugging your C++ projects with CLion

Using the OS X crash reporter to diagnose a program failure | MacIssues

Using the OS X crash reporter to diagnose a program failure | MacIssues

JMeter Response Assertion - Jmeter - OctoPerf

JMeter Response Assertion - Jmeter - OctoPerf

Junit Assert & AssertEquals with Example

Junit Assert & AssertEquals with Example

how to fix Error 2 Visual runtime C++ Runtime Library Game Ghost Recon  Phantoms

how to fix Error 2 Visual runtime C++ Runtime Library Game Ghost Recon Phantoms

Microsoft Visual C++ Runtime Library Assertion Failed! - Microsoft

Microsoft Visual C++ Runtime Library Assertion Failed! - Microsoft

Vysor assertion failed Black Screen | Music Jinni

Vysor assertion failed Black Screen | Music Jinni

Assertion failed on render_mob (crash) - Crash Reports - Stonehearth

Assertion failed on render_mob (crash) - Crash Reports - Stonehearth

How to debug

How to debug "Debug Assertion Failed Buffer too small"? - Stack

Why I'm getting this exception: Assertion failed: Can't happen

Why I'm getting this exception: Assertion failed: Can't happen

Could not create a new document because Assertion in

Could not create a new document because Assertion in "/Volumes

JMeter Assertions: The Ultimate Guide - Jmeter - OctoPerf

JMeter Assertions: The Ultimate Guide - Jmeter - OctoPerf

Microsoft Visual C++ Runtime Library Assertion Failed! - Microsoft

Microsoft Visual C++ Runtime Library Assertion Failed! - Microsoft

Assertion failed!

Assertion failed!" "Microsoft Visual C++ Runtime Library" on javaw

R-791] Multi-Assertion Fails - Bug Reports - Stonehearth Discourse

R-791] Multi-Assertion Fails - Bug Reports - Stonehearth Discourse

Error- Assertion Failed - Line 1056 - Avid Community

Error- Assertion Failed - Line 1056 - Avid Community

[SOLVED] Debug Assertion Error in Visual Studio 2015,2013,2010 | C program

[SOLVED] Debug Assertion Error in Visual Studio 2015,2013,2010 | C program

QTBUG-68029] WIN64: 'Access violation reading location

QTBUG-68029] WIN64: 'Access violation reading location

Does anyone know how to fix this? : ARK

Does anyone know how to fix this? : ARK

Can't get pass the launcher  shippingpc-bmgame exe [Archive

Can't get pass the launcher shippingpc-bmgame exe [Archive